Reaction Details
TargetCannabinoid receptor 1
LigandBDBM50306526
Substrate/Competitorn/a
Meas. Tech.ChEMBL_610611 (CHEMBL1069625)
Ki 955±n/a nM
Citation Burdick, DDeOrazio, RGuzzo, PHabershaw, AHelle, MPaul, BWolf, M Synthesis and structure-activity relationship of substitutions at the C-1 position of Delta9-tetrahydrocannabinol. Bioorg Med Chem Lett20:1424-6 (2010) 
 
Cannabinoid receptor 1
Name:Cannabinoid receptor 1
Type:G Protein-Coupled Receptor (GPCR)
Mol. Mass.:52868.96
Organism:Homo sapiens (Human)
Description:P21554
Residue:472
BDBM50306526
NameBDBM50306526
Synonyms:(6aR,10aR)-6,6,9-trimethyl-1-(methylthio)-3-pentyl-6a,7,8,10a-tetrahydro-6H-benzo[c]chromene | CHEMBL602702
TypeSmall organic molecule
Emp. Form.C22H32OS
Mol. Mass.344.554
SMILESCCCCCc1cc2OC(C)(C)[C@@H]3CCC(C)=C[C@H]3c2c(SC)c1