Reaction Details
TargetCannabinoid receptor 1
LigandBDBM50306533
Substrate/Competitorn/a
Meas. Tech.ChEMBL_610611 (CHEMBL1069625)
Ki>3000±n/a nM
Citation Burdick, DDeOrazio, RGuzzo, PHabershaw, AHelle, MPaul, BWolf, M Synthesis and structure-activity relationship of substitutions at the C-1 position of Delta9-tetrahydrocannabinol. Bioorg Med Chem Lett20:1424-6 (2010) 
 
Cannabinoid receptor 1
Name:Cannabinoid receptor 1
Type:G Protein-Coupled Receptor (GPCR)
Mol. Mass.:52868.96
Organism:Homo sapiens (Human)
Description:P21554
Residue:472
BDBM50306533
NameBDBM50306533
Synonyms:CHEMBL600397 | N-((6aR,10aR)-6,6,9-trimethyl-3-(2-methyloctan-2-yl)-6a,7,8,10a-tetrahydro-6H-benzo[c]chromen-1-yl)isonicotinamide
TypeSmall organic molecule
Emp. Form.C31H42N2O2
Mol. Mass.474.6774
SMILESCCCCCCC(C)(C)c1cc(NC(=O)c2ccncc2)c2[C@@H]3C=C(C)CC[C@H]3C(C)(C)Oc2c1