Reaction Details
TargetLysine-specific demethylase 4A
LigandBDBM50306580
Substrate/Competitorn/a
Meas. Tech.ChEMBL_610953 (CHEMBL1070284)
IC50 12000±n/a nM
Citation Rose, NRWoon, ECKingham, GLKing, ONMecinovic, JClifton, IJNg, SSTalib-Hardy, JOppermann, UMcDonough, MASchofield, CJ Selective inhibitors of the JMJD2 histone demethylases: combined nondenaturing mass spectrometric screening and crystallographic approaches. J Med Chem53:1810-8 (2010) 
 
Lysine-specific demethylase 4A
Name:Lysine-specific demethylase 4A
Type:Enzyme
Mol. Mass.:120647.83
Organism:Homo sapiens (Human)
Description:O75164
Residue:1064
BDBM50306580
NameBDBM50306580
Synonyms:(R)-3-(4-(4-bromophenylsulfonyloxy)phenyl)-2-(carboxyformamido)propanoic acid | CHEMBL602503
TypeSmall organic molecule
Emp. Form.C17H14BrNO8S
Mol. Mass.472.264
SMILESOC(=O)[C@@H](Cc1ccc(OS(=O)(=O)c2ccc(Br)cc2)cc1)NC(=O)C(O)=O