Reaction Details
TargetCruzipain
LigandBDBM50306595
Substrate/Competitorn/a
Meas. Tech.ChEMBL_611209 (CHEMBL1065731)
Ki 940±n/a nM
Citation Brak, KKerr, IDBarrett, KTFuchi, NDebnath, MAng, KEngel, JCMcKerrow, JHDoyle, PSBrinen, LSEllman, JA Nonpeptidic tetrafluorophenoxymethyl ketone cruzain inhibitors as promising new leads for Chagas disease chemotherapy. J Med Chem53:1763-73 (2010) 
 
Cruzipain
Name:Cruzipain
Type:Protein
Mol. Mass.:49831.41
Organism:Trypanosoma cruzi
Description:P25779
Residue:467
BDBM50306595
NameBDBM50306595
Synonyms:3-(4-((S)-1-cyclopropyl-1-(quinolin-6-ylmethylamino)ethyl)-1H-1,2,3-triazol-1-yl)-1-(2,3,5,6-tetrafluorophenoxy)heptan-2-one | CHEMBL592403
TypeSmall organic molecule
Emp. Form.C30H31F4N5O2
Mol. Mass.569.5931
SMILESCCCCC(C(=O)COc1c(F)c(F)cc(F)c1F)n1cc(nn1)[C@@](C)(NCc1ccc2ncccc2c1)C1CC1