Reaction Details
TargetHepatocyte growth factor receptor
LigandBDBM50306677
Substrate/Competitorn/a
Meas. Tech.ChEMBL_611549 (CHEMBL1066393)
IC50 20±n/a nM
Citation Nishii, HChiba, TMorikami, KFukami, TASakamoto, HKo, KKoyano, H Discovery of 6-benzyloxyquinolines as c-Met selective kinase inhibitors. Bioorg Med Chem Lett20:1405-9 (2010) 
 
Hepatocyte growth factor receptor
Name:Hepatocyte growth factor receptor
Type:Protein
Mol. Mass.:155559.73
Organism:Homo sapiens (Human)
Description:P08581
Residue:1390
BDBM50306677
NameBDBM50306677
Synonyms:(R)-3-(6-(1-(2,6-dichloro-3-fluorophenyl)ethoxy)quinolin-3-yl)acrylamide | CHEMBL602471
TypeSmall organic molecule
Emp. Form.C20H15Cl2FN2O2
Mol. Mass.405.25
SMILESC[C@@H](Oc1ccc2ncc(\C=C\C(N)=O)cc2c1)c1c(Cl)ccc(F)c1Cl