Reaction Details
TargetProto-oncogene tyrosine-protein kinase Src
LigandBDBM50306679
Substrate/Competitorn/a
Meas. Tech.ChEMBL_611551 (CHEMBL1066395)
IC50>50000±n/a nM
Citation Nishii, HChiba, TMorikami, KFukami, TASakamoto, HKo, KKoyano, H Discovery of 6-benzyloxyquinolines as c-Met selective kinase inhibitors. Bioorg Med Chem Lett20:1405-9 (2010) 
 
Proto-oncogene tyrosine-protein kinase Src
Name:Proto-oncogene tyrosine-protein kinase Src
Type:Protein
Mol. Mass.:59838.60
Organism:Homo sapiens (Human)
Description:P12931
Residue:536
BDBM50306679
NameBDBM50306679
Synonyms:CHEMBL608738 | rac-3-(6-(1-(2,6-dichloro-3-fluorophenyl)ethoxy)quinolin-3-yl)-N,N-dimethylacrylamide
TypeSmall organic molecule
Emp. Form.C22H19Cl2FN2O2
Mol. Mass.433.303
SMILESCC(Oc1ccc2ncc(\C=C\C(=O)N(C)C)cc2c1)c1c(Cl)ccc(F)c1Cl