Reaction Details
TargetHepatocyte growth factor receptor
LigandBDBM50306679
Substrate/Competitorn/a
Meas. Tech.ChEMBL_611549 (CHEMBL1066393)
IC50 59±n/a nM
Citation Nishii, HChiba, TMorikami, KFukami, TASakamoto, HKo, KKoyano, H Discovery of 6-benzyloxyquinolines as c-Met selective kinase inhibitors. Bioorg Med Chem Lett20:1405-9 (2010) 
 
Hepatocyte growth factor receptor
Name:Hepatocyte growth factor receptor
Type:Protein
Mol. Mass.:155559.73
Organism:Homo sapiens (Human)
Description:P08581
Residue:1390
BDBM50306679
NameBDBM50306679
Synonyms:CHEMBL608738 | rac-3-(6-(1-(2,6-dichloro-3-fluorophenyl)ethoxy)quinolin-3-yl)-N,N-dimethylacrylamide
TypeSmall organic molecule
Emp. Form.C22H19Cl2FN2O2
Mol. Mass.433.303
SMILESCC(Oc1ccc2ncc(\C=C\C(=O)N(C)C)cc2c1)c1c(Cl)ccc(F)c1Cl