Reaction Details
TargetAurora kinase A
LigandBDBM50306677
Substrate/Competitorn/a
Meas. Tech.ChEMBL_611568 (CHEMBL1066412)
IC50 6400±n/a nM
Citation Nishii, HChiba, TMorikami, KFukami, TASakamoto, HKo, KKoyano, H Discovery of 6-benzyloxyquinolines as c-Met selective kinase inhibitors. Bioorg Med Chem Lett20:1405-9 (2010) 
 
Aurora kinase A
Name:Aurora kinase A
Type:Serine/threonine-protein kinase
Mol. Mass.:45830.98
Organism:Homo sapiens (Human)
Description:O14965
Residue:403
BDBM50306677
NameBDBM50306677
Synonyms:(R)-3-(6-(1-(2,6-dichloro-3-fluorophenyl)ethoxy)quinolin-3-yl)acrylamide | CHEMBL602471
TypeSmall organic molecule
Emp. Form.C20H15Cl2FN2O2
Mol. Mass.405.25
SMILESC[C@@H](Oc1ccc2ncc(\C=C\C(N)=O)cc2c1)c1c(Cl)ccc(F)c1Cl