Reaction Details
TargetTyrosine-protein kinase Fyn
LigandBDBM50306677
Substrate/Competitorn/a
Meas. Tech.ChEMBL_611558 (CHEMBL1066402)
IC50 28000±n/a nM
Citation Nishii, HChiba, TMorikami, KFukami, TASakamoto, HKo, KKoyano, H Discovery of 6-benzyloxyquinolines as c-Met selective kinase inhibitors. Bioorg Med Chem Lett20:1405-9 (2010) 
 
Tyrosine-protein kinase Fyn
Name:Tyrosine-protein kinase Fyn
Type:Enzyme
Mol. Mass.:60762.21
Organism:Homo sapiens (Human)
Description:P06241
Residue:537
BDBM50306677
NameBDBM50306677
Synonyms:(R)-3-(6-(1-(2,6-dichloro-3-fluorophenyl)ethoxy)quinolin-3-yl)acrylamide | CHEMBL602471
TypeSmall organic molecule
Emp. Form.C20H15Cl2FN2O2
Mol. Mass.405.25
SMILESC[C@@H](Oc1ccc2ncc(\C=C\C(N)=O)cc2c1)c1c(Cl)ccc(F)c1Cl