Reaction Details
TargetLeukocyte tyrosine kinase receptor
LigandBDBM50306684
Substrate/Competitorn/a
Meas. Tech.ChEMBL_611555 (CHEMBL1066399)
IC50 10000±n/a nM
Citation Nishii, HChiba, TMorikami, KFukami, TASakamoto, HKo, KKoyano, H Discovery of 6-benzyloxyquinolines as c-Met selective kinase inhibitors. Bioorg Med Chem Lett20:1405-9 (2010) 
 
Leukocyte tyrosine kinase receptor
Name:Leukocyte tyrosine kinase receptor
Type:PROTEIN
Mol. Mass.:91679.76
Organism:Homo sapiens (Human)
Description:ChEMBL_586334
Residue:864
BDBM50306684
NameBDBM50306684
Synonyms:2-(6-((R)-1-(2,6-dichloro-3-fluorophenyl)ethoxy)quinolin-3-yl)cyclopropanecarboxamide | CHEMBL602472
TypeSmall organic molecule
Emp. Form.C21H17Cl2FN2O2
Mol. Mass.419.276
SMILESC[C@@H](Oc1ccc2ncc(cc2c1)C1CC1C(N)=O)c1c(Cl)ccc(F)c1Cl