Reaction Details
TargetVascular endothelial growth factor receptor 2
LigandBDBM50306685
Substrate/Competitorn/a
Meas. Tech.ChEMBL_611550 (CHEMBL1066394)
IC50>50000±n/a nM
Citation Nishii, HChiba, TMorikami, KFukami, TASakamoto, HKo, KKoyano, H Discovery of 6-benzyloxyquinolines as c-Met selective kinase inhibitors. Bioorg Med Chem Lett20:1405-9 (2010) 
 
Vascular endothelial growth factor receptor 2
Name:Vascular endothelial growth factor receptor 2
Type:Receptor Tyrosine Kinase
Mol. Mass.:151510.97
Organism:Homo sapiens (Human)
Description:P35968
Residue:1356
BDBM50306685
NameBDBM50306685
Synonyms:CHEMBL602470 | rac-3-(6-(1-(2,6-dichloro-3-fluorophenyl)ethoxy)quinolin-3-yl)acrylic acid
TypeSmall organic molecule
Emp. Form.C20H14Cl2FNO3
Mol. Mass.406.234
SMILESCC(Oc1ccc2ncc(\C=C\C(O)=O)cc2c1)c1c(Cl)ccc(F)c1Cl