Reaction Details
TargetBeta-1 adrenergic receptor
LigandBDBM50306814
Substrate/Competitorn/a
Meas. Tech.ChEMBL_611945 (CHEMBL1071506)
EC50 4.5±n/a nM
Citation Bouyssou, THoenke, CRudolf, KLustenberger, PPestel, SSieger, PLotz, RHeine, CBüttner, FHSchnapp, AKonetzki, I Discovery of olodaterol, a novel inhaled beta2-adrenoceptor agonist with a 24 h bronchodilatory efficacy. Bioorg Med Chem Lett20:1410-4 (2010) 
 
Beta-1 adrenergic receptor
Name:Beta-1 adrenergic receptor
Type:G Protein-Coupled Receptor (GPCR)
Mol. Mass.:51338.40
Organism:Homo sapiens (Human)
Description:P08588
Residue:477
BDBM50306814
NameBDBM50306814
Synonyms:CHEMBL601036 | rac-6-hydroxy-8-(1-hydroxy-2-(2-methyl-1-o-tolylpropan-2-ylamino)ethyl)-2H-benzo[b][1,4]oxazin-3(4H)-one
TypeSmall organic molecule
Emp. Form.C21H26N2O4
Mol. Mass.370.4421
SMILESCc1ccccc1CC(C)(C)NCC(O)c1cc(O)cc2NC(=O)COc12