Reaction Details
TargetP2Y purinoceptor 12
LigandBDBM50307007
Substrate/Competitorn/a
Meas. Tech.ChEMBL_609034 (CHEMBL1064501)
Ki 3.2±n/a nM
Citation Parlow, JJBurney, MWCase, BLGirard, TJHall, KAHarris, PKHiebsch, RRHuff, RMLachance, RMMischke, DARapp, SRWoerndle, RSEnnis, MD Part II: piperazinyl-glutamate-pyridines as potent orally bioavailable P2Y12 antagonists for inhibition of platelet aggregation. Bioorg Med Chem Lett20:1388-94 (2010) 
 
P2Y purinoceptor 12
Name:P2Y purinoceptor 12
Type:Enzyme
Mol. Mass.:39458.48
Organism:Homo sapiens (Human)
Description:Q9H244
Residue:342
BDBM50307007
NameBDBM50307007
Synonyms:(4S)5-[4-(Butoxycarbonyl)piperazin-1-yl]-4-{[(4-{4-[(dimethylamino)ethyl]piperidin-1-yl}-6-phenylpyridin-2-yl)carbonyl]amino}-5-oxopentanoic Acid CHEMBL589584
TypeSmall organic molecule
Emp. Form.C34H48N6O6
Mol. Mass.636.7815
SMILESCCCCOC(=O)N1CCN(CC1)C(=O)[C@H](CCC(O)=O)NC(=O)c1cc(cc(n1)-c1ccccc1)N1CCC(CN(C)C)CC1