Reaction Details
TargetMonoacylglycerol lipase ABHD6
LigandBDBM50307062
Substrate/Competitorn/a
Meas. Tech.ChEMBL_609360 (CHEMBL1072746)
IC50 740±n/a nM
Citation Long, JZJin, XAdibekian, ALi, WCravatt, BF Characterization of tunable piperidine and piperazine carbamates as inhibitors of endocannabinoid hydrolases. J Med Chem53:1830-42 (2010) 
 
Monoacylglycerol lipase ABHD6
Name:Monoacylglycerol lipase ABHD6
Type:Single-pass type II membrane protein; hydrolase
Mol. Mass.:38216.17
Organism:Mus musculus (mouse)
Description:Assays were using membranes of recombinant Abh6 transiently transfected in COS-7 cells.
Residue:336
BDBM50307062
NameBDBM50307062
Synonyms:4-Nitrophenyl 4-Benzylpiperazine-1-carboxylate | CHEMBL597700
TypeSmall organic molecule
Emp. Form.C18H19N3O4
Mol. Mass.341.3612
SMILES[O-][N+](=O)c1ccc(OC(=O)N2CCN(Cc3ccccc3)CC2)cc1