Reaction Details
TargetMonoglyceride lipase
LigandBDBM50307085
Substrate/Competitorn/a
Meas. Tech.ChEMBL_609359 (CHEMBL1072745)
IC50 50±n/a nM
Citation Long, JZJin, XAdibekian, ALi, WCravatt, BF Characterization of tunable piperidine and piperazine carbamates as inhibitors of endocannabinoid hydrolases. J Med Chem53:1830-42 (2010) 
 
Monoglyceride lipase
Name:Monoglyceride lipase
Type:Hydrolase
Mol. Mass.:33391.67
Organism:Mus musculus (mouse)
Description:Assays were using membranes of recombinant MAG Lipase transiently transfected in COS-7 cells.
Residue:303
BDBM50307085
NameBDBM50307085
Synonyms:4-Nitrophenyl 4-((5-Phenylthiophen-2-yl)methyl)piperazine-1-carboxylate | CHEMBL601243
TypeSmall organic molecule
Emp. Form.C22H21N3O4S
Mol. Mass.423.485
SMILES[O-][N+](=O)c1ccc(OC(=O)N2CCN(Cc3ccc(s3)-c3ccccc3)CC2)cc1