Reaction Details
TargetMonoglyceride lipase
LigandBDBM50307059
Substrate/Competitorn/a
Meas. Tech.ChEMBL_609359 (CHEMBL1072745)
IC50 130±n/a nM
Citation Long, JZJin, XAdibekian, ALi, WCravatt, BF Characterization of tunable piperidine and piperazine carbamates as inhibitors of endocannabinoid hydrolases. J Med Chem53:1830-42 (2010) 
 
Monoglyceride lipase
Name:Monoglyceride lipase
Type:Hydrolase
Mol. Mass.:33391.67
Organism:Mus musculus (mouse)
Description:Assays were using membranes of recombinant MAG Lipase transiently transfected in COS-7 cells.
Residue:303
BDBM50307059
NameBDBM50307059
Synonyms:4-Nitrophenyl 4-(3-(4-Methoxyphenoxy)benzyl)piperazine-1-carboxylate | CHEMBL603111
TypeSmall organic molecule
Emp. Form.C25H25N3O6
Mol. Mass.463.4825
SMILESCOc1ccc(Oc2cccc(CN3CCN(CC3)C(=O)Oc3ccc(cc3)[N+]([O-])=O)c2)cc1