Reaction Details
TargetMonoglyceride lipase
LigandBDBM50307077
Substrate/Competitorn/a
Meas. Tech.ChEMBL_609359 (CHEMBL1072745)
IC50 1300±n/a nM
Citation Long, JZJin, XAdibekian, ALi, WCravatt, BF Characterization of tunable piperidine and piperazine carbamates as inhibitors of endocannabinoid hydrolases. J Med Chem53:1830-42 (2010) 
 
Monoglyceride lipase
Name:Monoglyceride lipase
Type:Hydrolase
Mol. Mass.:33391.67
Organism:Mus musculus (mouse)
Description:Assays were using membranes of recombinant MAG Lipase transiently transfected in COS-7 cells.
Residue:303
BDBM50307077
NameBDBM50307077
Synonyms:4-Nitrophenyl 4-(Bis(3,4-dimethoxyphenyl)(hydroxy)methyl)-piperidine-1-carboxylate | CHEMBL599726
TypeSmall organic molecule
Emp. Form.C29H32N2O9
Mol. Mass.552.5724
SMILESCOc1ccc(cc1OC)C(O)(C1CCN(CC1)C(=O)Oc1ccc(cc1)[N+]([O-])=O)c1ccc(OC)c(OC)c1