Reaction Details
TargetMonoglyceride lipase
LigandBDBM50307066
Substrate/Competitorn/a
Meas. Tech.ChEMBL_609359 (CHEMBL1072745)
IC50 2120±n/a nM
Citation Long, JZJin, XAdibekian, ALi, WCravatt, BF Characterization of tunable piperidine and piperazine carbamates as inhibitors of endocannabinoid hydrolases. J Med Chem53:1830-42 (2010) 
 
Monoglyceride lipase
Name:Monoglyceride lipase
Type:Hydrolase
Mol. Mass.:33391.67
Organism:Mus musculus (mouse)
Description:Assays were using membranes of recombinant MAG Lipase transiently transfected in COS-7 cells.
Residue:303
BDBM50307066
NameBDBM50307066
Synonyms:4-Nitrophenyl 4-(Bis(4-(dimethylamino)phenyl)(hydroxy)-methyl)piperidine-1-carboxylate | CHEMBL605004
TypeSmall organic molecule
Emp. Form.C29H34N4O5
Mol. Mass.518.6041
SMILESCN(C)c1ccc(cc1)C(O)(C1CCN(CC1)C(=O)Oc1ccc(cc1)[N+]([O-])=O)c1ccc(cc1)N(C)C