Reaction Details
TargetMonoglyceride lipase
LigandBDBM50307078
Substrate/Competitorn/a
Meas. Tech.ChEMBL_609359 (CHEMBL1072745)
IC50>100000±n/a nM
Citation Long, JZJin, XAdibekian, ALi, WCravatt, BF Characterization of tunable piperidine and piperazine carbamates as inhibitors of endocannabinoid hydrolases. J Med Chem53:1830-42 (2010) 
 
Monoglyceride lipase
Name:Monoglyceride lipase
Type:Hydrolase
Mol. Mass.:33391.67
Organism:Mus musculus (mouse)
Description:Assays were using membranes of recombinant MAG Lipase transiently transfected in COS-7 cells.
Residue:303
BDBM50307078
NameBDBM50307078
Synonyms:4-Nitrophenyl 4-(3-(3,5-Dichlorophenoxy)benzyl)piperazine-1-carboxylate | CHEMBL601003
TypeSmall organic molecule
Emp. Form.C24H21Cl2N3O5
Mol. Mass.502.347
SMILES[O-][N+](=O)c1ccc(OC(=O)N2CCN(Cc3cccc(Oc4cc(Cl)cc(Cl)c4)c3)CC2)cc1