Reaction Details
TargetCoagulation factor X
LigandBDBM19023
Substrate/Competitorn/a
Meas. Tech.ChEMBL_609369 (CHEMBL1072755)
Ki 0.08±n/a nM
Citation Quan, MLPinto, DJRossi, KASheriff, SAlexander, RSAmparo, EKish, KKnabb, RMLuettgen, JMMorin, PSmallwood, AWoerner, FJWexler, RR Phenyltriazolinones as potent factor Xa inhibitors. Bioorg Med Chem Lett20:1373-7 (2010) 
 
Coagulation factor X
Name:Coagulation factor X
Type:Enzyme
Mol. Mass.:54726.60
Organism:Homo sapiens (Human)
Description:n/a
Residue:488
BDBM19023
NameBDBM19023
Synonyms:1-(4-methoxyphenyl)-7-oxo-6-[4-(2-oxopiperidin-1-yl)phenyl]-1H,4H,5H,6H,7H-pyrazolo[3,4-c]pyridine-3-carboxamide BMS-562247 US9938272, Example Apixaban
TypeSmall organic molecule
Emp. Form.C25H25N5O4
Mol. Mass.459.4971
SMILESCOc1ccc(cc1)-n1nc(C(N)=O)c2CCN(C(=O)c12)c1ccc(cc1)N1CCCCC1=O