Reaction Details
Target11-beta-hydroxysteroid dehydrogenase 1
LigandBDBM50148911
Substrate/Competitorn/a
Meas. Tech.ChEMBL_609376 (CHEMBL1072762)
IC50 1900±n/a nM
Citation Rollinger, JMKratschmar, DVSchuster, DPfisterer, PHGumy, CAubry, EMBrandstötter, SStuppner, HWolber, GOdermatt, A 11beta-Hydroxysteroid dehydrogenase 1 inhibiting constituents from Eriobotrya japonica revealed by bioactivity-guided isolation and computational approaches. Bioorg Med Chem18:1507-15 (2010) 
 
11-beta-hydroxysteroid dehydrogenase 1
Name:11-beta-hydroxysteroid dehydrogenase 1
Type:Enzyme
Mol. Mass.:32409.16
Organism:Homo sapiens (Human)
Description:P28845
Residue:292
BDBM50148911
NameBDBM50148911
Synonyms:(3beta)-3-hydroxyurs-12-en-28-oic acid CHEMBL169 malol urson
TypeSmall organic molecule
Emp. Form.C30H48O3
Mol. Mass.456.7003
SMILESC[C@@H]1CC[C@@]2(CC[C@]3(C)C(=CC[C@@H]4[C@@]5(C)CC[C@H](O)C(C)(C)[C@@H]5CC[C@@]34C)[C@@H]2[C@H]1C)C(O)=O