Reaction Details
TargetCytochrome P450 11B1, mitochondrial
LigandBDBM50307243
Substrate/Competitorn/a
Meas. Tech.ChEMBL_610341 (CHEMBL1072073)
IC50 5.7±n/a nM
Citation Roumen, LPeeters, JWEmmen, JMBeugels, IPCusters, EMde Gooyer, MPlate, RPieterse, KHilbers, PASmits, JFVekemans, JALeysen, DOttenheijm, HCJanssen, HMHermans, JJ Synthesis, biological evaluation, and molecular modeling of 1-benzyl-1H-imidazoles as selective inhibitors of aldosterone synthase (CYP11B2). J Med Chem53:1712-25 (2010) 
 
Cytochrome P450 11B1, mitochondrial
Name:Cytochrome P450 11B1, mitochondrial
Type:Enzyme
Mol. Mass.:57591.44
Organism:Homo sapiens (Human)
Description:P15538
Residue:503
BDBM50307243
NameBDBM50307243
Synonyms:1-(4-Cyanobenzyl)-5-(2-methylphenyl)-1H-imidazole | CHEMBL610513
TypeSmall organic molecule
Emp. Form.C18H15N3
Mol. Mass.273.3318
SMILESCc1ccccc1-c1cncn1Cc1ccc(cc1)C#N