Reaction Details
TargetCytochrome P450 11B2, mitochondrial
LigandBDBM7887
Substrate/Competitorn/a
Meas. Tech.ChEMBL_610340 (CHEMBL1072072)
IC50 1799±n/a nM
Citation Roumen, LPeeters, JWEmmen, JMBeugels, IPCusters, EMde Gooyer, MPlate, RPieterse, KHilbers, PASmits, JFVekemans, JALeysen, DOttenheijm, HCJanssen, HMHermans, JJ Synthesis, biological evaluation, and molecular modeling of 1-benzyl-1H-imidazoles as selective inhibitors of aldosterone synthase (CYP11B2). J Med Chem53:1712-25 (2010) 
 
Cytochrome P450 11B2, mitochondrial
Name:Cytochrome P450 11B2, mitochondrial
Type:Protein
Mol. Mass.:57582.15
Organism:Homo sapiens (Human)
Description:P19099
Residue:503
BDBM7887
NameBDBM7887
Synonyms:1-Benzylimidazole (BI) 1-benzylimidazole US9138393, 1-benzylimidazole
TypeSmall organic molecule
Emp. Form.C10H10N2
Mol. Mass.158.1998
SMILESC(c1ccccc1)n1ccnc1