Reaction Details
TargetCytochrome P450 11B2, mitochondrial
LigandBDBM50125935
Substrate/Competitorn/a
Meas. Tech.ChEMBL_610340 (CHEMBL1072072)
IC50 1.7±n/a nM
Citation Roumen, LPeeters, JWEmmen, JMBeugels, IPCusters, EMde Gooyer, MPlate, RPieterse, KHilbers, PASmits, JFVekemans, JALeysen, DOttenheijm, HCJanssen, HMHermans, JJ Synthesis, biological evaluation, and molecular modeling of 1-benzyl-1H-imidazoles as selective inhibitors of aldosterone synthase (CYP11B2). J Med Chem53:1712-25 (2010) 
 
Cytochrome P450 11B2, mitochondrial
Name:Cytochrome P450 11B2, mitochondrial
Type:Protein
Mol. Mass.:57582.15
Organism:Homo sapiens (Human)
Description:P19099
Residue:503
BDBM50125935
NameBDBM50125935
Synonyms:(R)-1-(1-phenylethyl)-1H-imidazole-5-carboxylic acid ethyl ester 3-((R)-1-Phenyl-ethyl)-3H-imidazole-4-carboxylic acid ethyl ester CHEMBL681 R(+)-etomidate | R-ETOMIDATE
TypeSmall organic molecule
Emp. Form.C14H16N2O2
Mol. Mass.244.289
SMILESCCOC(=O)c1cncn1[C@H](C)c1ccccc1