Reaction Details
TargetProstaglandin E2 receptor EP3 subtype
LigandBDBM50307403
Substrate/Competitorn/a
Meas. Tech.ChEMBL_610979 (CHEMBL1070310)
Ki 0.16±n/a nM
Citation Asada, MIwahashi, MObitsu, TKinoshita, ANakai, YOnoda, TNagase, TTanaka, MYamaura, YTakizawa, HYoshikawa, KSato, KNarita, MOhuchida, SNakai, HToda, M 3-(2-Aminocarbonylphenyl)propanoic acid analogs as potent and selective EP3 receptor antagonists. part 2: optimization of the side chains to improve in vitro and in vivo potencies. Bioorg Med Chem18:1641-58 (2010) 
 
Prostaglandin E2 receptor EP3 subtype
Name:Prostaglandin E2 receptor EP3 subtype
Type:G-protein coupled receptor
Mol. Mass.:40092.50
Organism:Mus musculus (Mouse)
Description:n/a
Residue:365
BDBM50307403
NameBDBM50307403
Synonyms:3-[2-({[1-(4-Fluoro-3-methylphenyl)-3-methylbutyl]-amino}carbonyl)-4-(phenoxymethyl)phenyl]propanoic acid | CHEMBL604708
TypeSmall organic molecule
Emp. Form.C29H32FNO4
Mol. Mass.477.5671
SMILESCC(C)CC(NC(=O)c1cc(COc2ccccc2)ccc1CCC(O)=O)c1ccc(F)c(C)c1