Reaction Details
TargetProstaglandin E2 receptor EP3 subtype
LigandBDBM50307407
Substrate/Competitorn/a
Meas. Tech.ChEMBL_610979 (CHEMBL1070310)
Ki 0.17±n/a nM
Citation Asada, MIwahashi, MObitsu, TKinoshita, ANakai, YOnoda, TNagase, TTanaka, MYamaura, YTakizawa, HYoshikawa, KSato, KNarita, MOhuchida, SNakai, HToda, M 3-(2-Aminocarbonylphenyl)propanoic acid analogs as potent and selective EP3 receptor antagonists. part 2: optimization of the side chains to improve in vitro and in vivo potencies. Bioorg Med Chem18:1641-58 (2010) 
 
Prostaglandin E2 receptor EP3 subtype
Name:Prostaglandin E2 receptor EP3 subtype
Type:G-protein coupled receptor
Mol. Mass.:40092.50
Organism:Mus musculus (Mouse)
Description:n/a
Residue:365
BDBM50307407
NameBDBM50307407
Synonyms:3-{2-({[1-(3,5-Dimethylphenyl)-3-methylbutyl]amino}-carbonyl)-4-[(2-methylphenoxy)methyl]phenyl}propanoic acid | CHEMBL596745
TypeSmall organic molecule
Emp. Form.C31H37NO4
Mol. Mass.487.6298
SMILESCC(C)CC(NC(=O)c1cc(COc2ccccc2C)ccc1CCC(O)=O)c1cc(C)cc(C)c1