Reaction Details
TargetProstaglandin E2 receptor EP3 subtype
LigandBDBM50307447
Substrate/Competitorn/a
Meas. Tech.ChEMBL_610979 (CHEMBL1070310)
Ki 0.2±n/a nM
Citation Asada, MIwahashi, MObitsu, TKinoshita, ANakai, YOnoda, TNagase, TTanaka, MYamaura, YTakizawa, HYoshikawa, KSato, KNarita, MOhuchida, SNakai, HToda, M 3-(2-Aminocarbonylphenyl)propanoic acid analogs as potent and selective EP3 receptor antagonists. part 2: optimization of the side chains to improve in vitro and in vivo potencies. Bioorg Med Chem18:1641-58 (2010) 
 
Prostaglandin E2 receptor EP3 subtype
Name:Prostaglandin E2 receptor EP3 subtype
Type:G-protein coupled receptor
Mol. Mass.:40092.50
Organism:Mus musculus (Mouse)
Description:n/a
Residue:365
BDBM50307447
NameBDBM50307447
Synonyms:3-[4-[(3-Cyanophenoxy)methyl]-2-({[1-(4-fluoro-3-methylphenyl)-3-methylbutyl]amino}carbonyl)phenyl]propanoic acid | CHEMBL606393
TypeSmall organic molecule
Emp. Form.C30H31FN2O4
Mol. Mass.502.5765
SMILESCC(C)CC(NC(=O)c1cc(COc2cccc(c2)C#N)ccc1CCC(O)=O)c1ccc(F)c(C)c1