Reaction Details
TargetPurine nucleoside phosphorylase
LigandBDBM50039547
Substrate/Competitorn/a
Meas. Tech.ChEMBL_611000 (CHEMBL1072376)
IC50 60±n/a nM
Citation Castilho, MSPostigo, MPPereira, HMOliva, GAndricopulo, AD Structural basis for selective inhibition of purine nucleoside phosphorylase from Schistosoma mansoni: kinetic and structural studies. Bioorg Med Chem18:1421-7 (2010) 
 
Purine nucleoside phosphorylase
Name:Purine nucleoside phosphorylase
Type:Enzyme
Mol. Mass.:32119.53
Organism:Homo sapiens (Human)
Description:n/a
Residue:289
BDBM50039547
NameBDBM50039547
Synonyms:2-Amino-7-benzyl-3,5-dihydro-pyrrolo[3,2-d]pyrimidin-4-one CHEMBL310202
TypeSmall organic molecule
Emp. Form.C13H12N4O
Mol. Mass.240.2606
SMILESNc1nc2c(Cc3ccccc3)c[nH]c2c(=O)[nH]1