Reaction Details
TargetSodium-dependent noradrenaline transporter
LigandBDBM50307458
Substrate/Competitorn/a
Meas. Tech.ChEMBL_611008 (CHEMBL1072384)
IC50 4.1±n/a nM
Citation Vu, ATCohn, STZhang, PKim, CYMahaney, PEBray, JAJohnston, GHKoury, EJCosmi, SADeecher, DCSmith, VAHarrison, JELeventhal, LWhiteside, GTKennedy, JDTrybulski, EJ 1-(Indolin-1-yl)-1-phenyl-3-propan-2-olamines as potent and selective norepinephrine reuptake inhibitors. J Med Chem53:2051-62 (2010) 
 
Sodium-dependent noradrenaline transporter
Name:Sodium-dependent noradrenaline transporter
Type:Multi-pass membrane protein
Mol. Mass.:69337.72
Organism:Homo sapiens (Human)
Description:P23975
Residue:617
BDBM50307458
NameBDBM50307458
Synonyms:(1S,2R)-1-(3,5-Difluorophenyl)-1-(3,3-dimethyl-2,3-dihydro-1H-indol-1-yl)-3-(methylamino)propan-2-ol Hydrochloride | CHEMBL600424
TypeSmall organic molecule
Emp. Form.C20H24F2N2O
Mol. Mass.346.4142
SMILESCNC[C@@H](O)[C@@H](N1CC(C)(C)c2ccccc12)c1cc(F)cc(F)c1