Reaction Details
TargetSodium-dependent dopamine transporter
LigandBDBM50307459
Substrate/Competitorn/a
Meas. Tech.ChEMBL_611011 (CHEMBL1072387)
IC50 20927±n/a nM
Citation Vu, ATCohn, STZhang, PKim, CYMahaney, PEBray, JAJohnston, GHKoury, EJCosmi, SADeecher, DCSmith, VAHarrison, JELeventhal, LWhiteside, GTKennedy, JDTrybulski, EJ 1-(Indolin-1-yl)-1-phenyl-3-propan-2-olamines as potent and selective norepinephrine reuptake inhibitors. J Med Chem53:2051-62 (2010) 
 
Sodium-dependent dopamine transporter
Name:Sodium-dependent dopamine transporter
Type:Multi-pass membrane protein
Mol. Mass.:68497.11
Organism:Homo sapiens (Human)
Description:Q01959
Residue:620
BDBM50307459
NameBDBM50307459
Synonyms:(1S,2R)-1-(7-Fluoro-3,3-dimethyl-2,3-dihydro-1H-indol-1-yl)-3-(methylamino)-1-phenylpropan-2-ol Hydrochloride | CHEMBL591928
TypeSmall organic molecule
Emp. Form.C20H25FN2O
Mol. Mass.328.4237
SMILESCNC[C@@H](O)[C@@H](N1CC(C)(C)c2cccc(F)c12)c1ccccc1