Reaction Details
TargetSodium-dependent noradrenaline transporter
LigandBDBM50259340
Substrate/Competitorn/a
Meas. Tech.ChEMBL_611007 (CHEMBL1072383)
IC50 12±n/a nM
Citation Vu, ATCohn, STZhang, PKim, CYMahaney, PEBray, JAJohnston, GHKoury, EJCosmi, SADeecher, DCSmith, VAHarrison, JELeventhal, LWhiteside, GTKennedy, JDTrybulski, EJ 1-(Indolin-1-yl)-1-phenyl-3-propan-2-olamines as potent and selective norepinephrine reuptake inhibitors. J Med Chem53:2051-62 (2010) 
 
Sodium-dependent noradrenaline transporter
Name:Sodium-dependent noradrenaline transporter
Type:Multi-pass membrane protein
Mol. Mass.:69337.72
Organism:Homo sapiens (Human)
Description:P23975
Residue:617
BDBM50259340
NameBDBM50259340
Synonyms:(1S,2R)-1-(3-fluorophenyl)-1-(methyl(phenyl)amino)-3-(methylamino)propan-2-ol CHEMBL467323
TypeSmall organic molecule
Emp. Form.C17H21FN2O
Mol. Mass.288.3598
SMILESCNC[C@@H](O)[C@@H](N(C)c1ccccc1)c1cccc(F)c1