Reaction Details
TargetSodium-dependent noradrenaline transporter
LigandBDBM50307461
Substrate/Competitorn/a
Meas. Tech.ChEMBL_611007 (CHEMBL1072383)
IC50 9.7±n/a nM
Citation Vu, ATCohn, STZhang, PKim, CYMahaney, PEBray, JAJohnston, GHKoury, EJCosmi, SADeecher, DCSmith, VAHarrison, JELeventhal, LWhiteside, GTKennedy, JDTrybulski, EJ 1-(Indolin-1-yl)-1-phenyl-3-propan-2-olamines as potent and selective norepinephrine reuptake inhibitors. J Med Chem53:2051-62 (2010) 
 
Sodium-dependent noradrenaline transporter
Name:Sodium-dependent noradrenaline transporter
Type:Multi-pass membrane protein
Mol. Mass.:69337.72
Organism:Homo sapiens (Human)
Description:P23975
Residue:617
BDBM50307461
NameBDBM50307461
Synonyms:(1S,2R)-1-(2,3-Dihydro-1H-indol-1-yl)-3-(methylamino)-1-phenylpropan-2-ol Hydrochloride | CHEMBL599608
TypeSmall organic molecule
Emp. Form.C18H22N2O
Mol. Mass.282.3801
SMILESCNC[C@@H](O)[C@@H](N1CCc2ccccc12)c1ccccc1