Reaction Details
TargetSodium-dependent noradrenaline transporter
LigandBDBM50307467
Substrate/Competitorn/a
Meas. Tech.ChEMBL_611007 (CHEMBL1072383)
IC50 14±n/a nM
Citation Vu, ATCohn, STZhang, PKim, CYMahaney, PEBray, JAJohnston, GHKoury, EJCosmi, SADeecher, DCSmith, VAHarrison, JELeventhal, LWhiteside, GTKennedy, JDTrybulski, EJ 1-(Indolin-1-yl)-1-phenyl-3-propan-2-olamines as potent and selective norepinephrine reuptake inhibitors. J Med Chem53:2051-62 (2010) 
 
Sodium-dependent noradrenaline transporter
Name:Sodium-dependent noradrenaline transporter
Type:Multi-pass membrane protein
Mol. Mass.:69337.72
Organism:Homo sapiens (Human)
Description:P23975
Residue:617
BDBM50307467
NameBDBM50307467
Synonyms:(1S,2R)-1-(3-Ethyl-2,3-dihydro-1H-indol-1-yl)-1-(3-fluorophenyl)-3-(methylamino)propan-2-ol Hydrochloride | CHEMBL597967
TypeSmall organic molecule
Emp. Form.C20H25FN2O
Mol. Mass.328.4237
SMILESCCC1CN([C@H]([C@H](O)CNC)c2cccc(F)c2)c2ccccc12