Reaction Details
TargetSodium-dependent noradrenaline transporter
LigandBDBM50307471
Substrate/Competitorn/a
Meas. Tech.ChEMBL_611007 (CHEMBL1072383)
IC50 15±n/a nM
Citation Vu, ATCohn, STZhang, PKim, CYMahaney, PEBray, JAJohnston, GHKoury, EJCosmi, SADeecher, DCSmith, VAHarrison, JELeventhal, LWhiteside, GTKennedy, JDTrybulski, EJ 1-(Indolin-1-yl)-1-phenyl-3-propan-2-olamines as potent and selective norepinephrine reuptake inhibitors. J Med Chem53:2051-62 (2010) 
 
Sodium-dependent noradrenaline transporter
Name:Sodium-dependent noradrenaline transporter
Type:Multi-pass membrane protein
Mol. Mass.:69337.72
Organism:Homo sapiens (Human)
Description:P23975
Residue:617
BDBM50307471
NameBDBM50307471
Synonyms:(1S,2R)-1-[5-(Benzyloxy)-2,3-dihydro-1H-indol-1-yl]-1-(3-fluorophenyl)-3-(methylamino)propan-2-ol Hydrochloride | CHEMBL601879
TypeSmall organic molecule
Emp. Form.C25H27FN2O2
Mol. Mass.406.4925
SMILESCNC[C@@H](O)[C@@H](N1CCc2cc(OCc3ccccc3)ccc12)c1cccc(F)c1