Reaction Details
TargetSodium-dependent serotonin transporter
LigandBDBM50307463
Substrate/Competitorn/a
Meas. Tech.ChEMBL_611006 (CHEMBL1072382)
IC50 84±n/a nM
Citation Vu, ATCohn, STZhang, PKim, CYMahaney, PEBray, JAJohnston, GHKoury, EJCosmi, SADeecher, DCSmith, VAHarrison, JELeventhal, LWhiteside, GTKennedy, JDTrybulski, EJ 1-(Indolin-1-yl)-1-phenyl-3-propan-2-olamines as potent and selective norepinephrine reuptake inhibitors. J Med Chem53:2051-62 (2010) 
 
Sodium-dependent serotonin transporter
Name:Sodium-dependent serotonin transporter
Type:Multi-pass membrane protein
Mol. Mass.:70322.51
Organism:Homo sapiens (Human)
Description:P31645
Residue:630
BDBM50307463
NameBDBM50307463
Synonyms:(1S,2R)-1-(3-Fluorophenyl)-3-(methylamino)-1-(2-methyl-2,3-dihydro-1H-indol-1-yl)propan-2-ol Hydrochloride | CHEMBL605213
TypeSmall organic molecule
Emp. Form.C19H23FN2O
Mol. Mass.314.3971
SMILESCNC[C@@H](O)[C@@H](N1C(C)Cc2ccccc12)c1cccc(F)c1