Reaction Details
TargetAurora kinase A
LigandBDBM50307523
Substrate/Competitorn/a
Meas. Tech.ChEMBL_611972 (CHEMBL1072179)
IC50>10000±n/a nM
Citation Traquandi, GCiomei, MBallinari, DCasale, EColombo, NCroci, VFiorentini, FIsacchi, ALongo, AMercurio, CPanzeri, APastori, WPevarello, PVolpi, DRoussel, PVulpetti, ABrasca, MG Identification of potent pyrazolo[4,3-h]quinazoline-3-carboxamides as multi-cyclin-dependent kinase inhibitors. J Med Chem53:2171-87 (2010) 
 
Aurora kinase A
Name:Aurora kinase A
Type:Serine/threonine-protein kinase
Mol. Mass.:45830.98
Organism:Homo sapiens (Human)
Description:O14965
Residue:403
BDBM50307523
NameBDBM50307523
Synonyms:8-(Cyclopentylamino)-N-1-dimethyl-4,5-dihydro-1H-pyrazolo-[4,3-h]quinazoline-3-carboxamide | CHEMBL598382
TypeSmall organic molecule
Emp. Form.C17H22N6O
Mol. Mass.326.3962
SMILESCNC(=O)c1nn(C)c-2c1CCc1cnc(NC3CCCC3)nc-21