Reaction Details
TargetAurora kinase A
LigandBDBM50307550
Substrate/Competitorn/a
Meas. Tech.ChEMBL_611972 (CHEMBL1072179)
IC50 1970±n/a nM
Citation Traquandi, GCiomei, MBallinari, DCasale, EColombo, NCroci, VFiorentini, FIsacchi, ALongo, AMercurio, CPanzeri, APastori, WPevarello, PVolpi, DRoussel, PVulpetti, ABrasca, MG Identification of potent pyrazolo[4,3-h]quinazoline-3-carboxamides as multi-cyclin-dependent kinase inhibitors. J Med Chem53:2171-87 (2010) 
 
Aurora kinase A
Name:Aurora kinase A
Type:Serine/threonine-protein kinase
Mol. Mass.:45830.98
Organism:Homo sapiens (Human)
Description:O14965
Residue:403
BDBM50307550
NameBDBM50307550
Synonyms:1-(1-Acetylpiperidin-4-yl)-8-(cyclopentylamino)-4,5-dihydro-1Hpyrazolo[4,3-h]quinazoline-3-carboxamide | CHEMBL603079
TypeSmall organic molecule
Emp. Form.C22H29N7O2
Mol. Mass.423.5114
SMILESCC(=O)N1CCC(CC1)n1nc(C(N)=O)c2CCc3cnc(NC4CCCC4)nc3-c12