Reaction Details
TargetGlycogen synthase kinase-3 beta
LigandBDBM50307535
Substrate/Competitorn/a
Meas. Tech.ChEMBL_611978 (CHEMBL1072185)
IC50 28±n/a nM
Citation Traquandi, GCiomei, MBallinari, DCasale, EColombo, NCroci, VFiorentini, FIsacchi, ALongo, AMercurio, CPanzeri, APastori, WPevarello, PVolpi, DRoussel, PVulpetti, ABrasca, MG Identification of potent pyrazolo[4,3-h]quinazoline-3-carboxamides as multi-cyclin-dependent kinase inhibitors. J Med Chem53:2171-87 (2010) 
 
Glycogen synthase kinase-3 beta
Name:Glycogen synthase kinase-3 beta
Type:Enzyme
Mol. Mass.:46756.38
Organism:Homo sapiens (Human)
Description:P49841
Residue:420
BDBM50307535
NameBDBM50307535
Synonyms:8-[(1-Acetylpiperidin-4-yl)amino]-1-methyl-4,5-dihydro-1H-pyrazolo[4,3-h]quinazoline-3-carboxamide | CHEMBL599224
TypeSmall organic molecule
Emp. Form.C18H23N7O2
Mol. Mass.369.4209
SMILESCC(=O)N1CCC(CC1)Nc1ncc2CCc3c(nn(C)c3-c2n1)C(N)=O