Reaction Details
TargetP2Y purinoceptor 12
LigandBDBM50307558
Substrate/Competitorn/a
Meas. Tech.ChEMBL_612285 (CHEMBL1064897)
Ki 1.7±n/a nM
Citation Parlow, JJBurney, MWCase, BLGirard, TJHall, KAHarris, PKHiebsch, RRHuff, RMLachance, RMMischke, DARapp, SRWoerndle, RSEnnis, MD Piperazinyl glutamate pyridines as potent orally bioavailable P2Y12 antagonists for inhibition of platelet aggregation. J Med Chem53:2010-37 (2010) 
 
P2Y purinoceptor 12
Name:P2Y purinoceptor 12
Type:Enzyme
Mol. Mass.:39458.48
Organism:Homo sapiens (Human)
Description:Q9H244
Residue:342
BDBM50307558
NameBDBM50307558
Synonyms:(4S)5-Oxo-5-{4-[(pentyloxy)carbonyl]piperazin-1-yl}-4-{[(6-phenyl-4-{[(piperidin-4-ylmethoxy)carbonyl]amino}pyridin-2-yl)carbonyl]amino}pentanoic acid | CHEMBL592410
TypeSmall organic molecule
Emp. Form.C38H54N6O8
Mol. Mass.722.8708
SMILESCCCCCOC(=O)N1CCN(CC1)C(=O)[C@H](CCC(=O)OC(C)(C)C)NC(=O)c1cc(NC(=O)OCC2CCNCC2)cc(n1)-c1ccccc1