Reaction Details
TargetP2Y purinoceptor 12
LigandBDBM50307561
Substrate/Competitorn/a
Meas. Tech.ChEMBL_612285 (CHEMBL1064897)
Ki 2.7±n/a nM
Citation Parlow, JJBurney, MWCase, BLGirard, TJHall, KAHarris, PKHiebsch, RRHuff, RMLachance, RMMischke, DARapp, SRWoerndle, RSEnnis, MD Piperazinyl glutamate pyridines as potent orally bioavailable P2Y12 antagonists for inhibition of platelet aggregation. J Med Chem53:2010-37 (2010) 
 
P2Y purinoceptor 12
Name:P2Y purinoceptor 12
Type:Enzyme
Mol. Mass.:39458.48
Organism:Homo sapiens (Human)
Description:Q9H244
Residue:342
BDBM50307561
NameBDBM50307561
Synonyms:(4S)4-{[(4-{[(Isopropylamino)carbonyl]amino}-6-phenylpyridin-2-yl)carbonyl]amino}-5-oxo-5-{4-[(pentyloxy)carbonyl]piperazin-1-yl}pentanoic acid | CHEMBL578080
TypeSmall organic molecule
Emp. Form.C35H50N6O7
Mol. Mass.666.8075
SMILESCCCCCOC(=O)N1CCN(CC1)C(=O)[C@H](CCC(=O)OC(C)(C)C)NC(=O)c1cc(NC(=O)NC(C)C)cc(n1)-c1ccccc1