Reaction Details
TargetP2Y purinoceptor 12
LigandBDBM50307010
Substrate/Competitorn/a
Meas. Tech.ChEMBL_612285 (CHEMBL1064897)
Ki 1.5±n/a nM
Citation Parlow, JJBurney, MWCase, BLGirard, TJHall, KAHarris, PKHiebsch, RRHuff, RMLachance, RMMischke, DARapp, SRWoerndle, RSEnnis, MD Piperazinyl glutamate pyridines as potent orally bioavailable P2Y12 antagonists for inhibition of platelet aggregation. J Med Chem53:2010-37 (2010) 
 
P2Y purinoceptor 12
Name:P2Y purinoceptor 12
Type:Enzyme
Mol. Mass.:39458.48
Organism:Homo sapiens (Human)
Description:Q9H244
Residue:342
BDBM50307010
NameBDBM50307010
Synonyms:(4S)4-{[(4-{4-[(Methylamino)ethyl]piperidin-1-yl}-6-phenylpyridin-2-yl)carbonyl]amino}-5-oxo-5-{4-[(pentyloxy)carbonyl]-piperazin-1-yl}pentanoic Acid CHEMBL589519
TypeSmall organic molecule
Emp. Form.C34H48N6O6
Mol. Mass.636.7815
SMILESCCCCCOC(=O)N1CCN(CC1)C(=O)[C@H](CCC(O)=O)NC(=O)c1cc(cc(n1)-c1ccccc1)N1CCC(CNC)CC1