Reaction Details
TargetP2Y purinoceptor 12
LigandBDBM50307673
Substrate/Competitorn/a
Meas. Tech.ChEMBL_612285 (CHEMBL1064897)
Ki 3.5±n/a nM
Citation Parlow, JJBurney, MWCase, BLGirard, TJHall, KAHarris, PKHiebsch, RRHuff, RMLachance, RMMischke, DARapp, SRWoerndle, RSEnnis, MD Piperazinyl glutamate pyridines as potent orally bioavailable P2Y12 antagonists for inhibition of platelet aggregation. J Med Chem53:2010-37 (2010) 
 
P2Y purinoceptor 12
Name:P2Y purinoceptor 12
Type:Enzyme
Mol. Mass.:39458.48
Organism:Homo sapiens (Human)
Description:Q9H244
Residue:342
BDBM50307673
NameBDBM50307673
Synonyms:(4S)4-({[4-(4-Aminopiperidin-1-yl)6-phenylpyridin-2-yl]carbonyl}amino)5-[4-(butoxycarbonyl)piperazin-1-yl]-5-oxopentanoic Acid | CHEMBL590741
TypeSmall organic molecule
Emp. Form.C31H42N6O6
Mol. Mass.594.7018
SMILESCCCCOC(=O)N1CCN(CC1)C(=O)[C@H](CCC(O)=O)NC(=O)c1cc(cc(n1)-c1ccccc1)N1CCC(N)CC1