Reaction Details
TargetP2Y purinoceptor 12
LigandBDBM50307704
Substrate/Competitorn/a
Meas. Tech.ChEMBL_612285 (CHEMBL1064897)
Ki 2.4±n/a nM
Citation Parlow, JJBurney, MWCase, BLGirard, TJHall, KAHarris, PKHiebsch, RRHuff, RMLachance, RMMischke, DARapp, SRWoerndle, RSEnnis, MD Piperazinyl glutamate pyridines as potent orally bioavailable P2Y12 antagonists for inhibition of platelet aggregation. J Med Chem53:2010-37 (2010) 
 
P2Y purinoceptor 12
Name:P2Y purinoceptor 12
Type:Enzyme
Mol. Mass.:39458.48
Organism:Homo sapiens (Human)
Description:Q9H244
Residue:342
BDBM50307704
NameBDBM50307704
Synonyms:(4S)5-[4-(Butoxycarbonyl)piperazin-1-yl]-4-{[(4-{[1-(methoxyacetyl)iperidin-4-yl]oxy}-6-phenylpyridin-2-yl)carbonyl]amino}-5-oxopentanoic Acid | CHEMBL579330
TypeSmall organic molecule
Emp. Form.C33H45N5O8
Mol. Mass.639.7391
SMILESCCCCOC(=O)N1CCN(CC1)C(=O)[C@H](CCC(O)=O)NC(=O)c1cc(OC2CCN(COC)CC2)cc(n1)-c1ccccc1