Reaction Details
TargetP2Y purinoceptor 12
LigandBDBM50307717
Substrate/Competitorn/a
Meas. Tech.ChEMBL_612285 (CHEMBL1064897)
Ki 2.8±n/a nM
Citation Parlow, JJBurney, MWCase, BLGirard, TJHall, KAHarris, PKHiebsch, RRHuff, RMLachance, RMMischke, DARapp, SRWoerndle, RSEnnis, MD Piperazinyl glutamate pyridines as potent orally bioavailable P2Y12 antagonists for inhibition of platelet aggregation. J Med Chem53:2010-37 (2010) 
 
P2Y purinoceptor 12
Name:P2Y purinoceptor 12
Type:Enzyme
Mol. Mass.:39458.48
Organism:Homo sapiens (Human)
Description:Q9H244
Residue:342
BDBM50307717
NameBDBM50307717
Synonyms:(4S)-5-Oxo-5-{4-[(pentyloxy)carbonyl]piperazin-1-yl}-4-({[6-phenyl-4-(piperidin-1-ylcarbonyl)pyridin-2-yl]carbonyl}amino)-pentanoic Acid | CHEMBL603152
TypeSmall organic molecule
Emp. Form.C33H43N5O7
Mol. Mass.621.7238
SMILESCCCCCOC(=O)N1CCN(CC1)C(=O)[C@H](CCC(O)=O)NC(=O)c1cc(cc(n1)-c1ccccc1)C(=O)N1CCCCC1