Reaction Details
TargetReceptor tyrosine-protein kinase erbB-2
LigandBDBM50307779
Substrate/Competitorn/a
Meas. Tech.ChEMBL_612310 (CHEMBL1064922)
IC50>2000±n/a nM
Citation Cai, XZhai, HXWang, JForrester, JQu, HYin, LLai, CJBao, RQian, C Discovery of 7-(4-(3-ethynylphenylamino)-7-methoxyquinazolin-6-yloxy)-N-hydroxyheptanamide (CUDc-101) as a potent multi-acting HDAC, EGFR, and HER2 inhibitor for the treatment of cancer. J Med Chem53:2000-9 (2010) 
 
Receptor tyrosine-protein kinase erbB-2
Name:Receptor tyrosine-protein kinase erbB-2
Type:n/a
Mol. Mass.:137894.47
Organism:Homo sapiens (Human)
Description:P04626
Residue:1255
BDBM50307779
NameBDBM50307779
Synonyms:7-(4-(3-chloro-4-fluorophenylamino)-7-methoxyquinazolin-6-ylsulfonyl)-N-hydroxyheptanamide | CHEMBL596755
TypeSmall organic molecule
Emp. Form.C22H24ClFN4O5S
Mol. Mass.510.966
SMILESCOc1cc2ncnc(Nc3ccc(F)c(Cl)c3)c2cc1S(=O)(=O)CCCCCCC(=O)NO