Reaction Details
TargetVascular endothelial growth factor receptor 2
LigandBDBM50307880
Substrate/Competitorn/a
Meas. Tech.ChEMBL_612855 (CHEMBL1067544)
IC50 1370±n/a nM
Citation Nourry, AZambon, ADavies, LNiculescu-Duvaz, IDijkstra, HPMénard, DGaulon, CNiculescu-Duvaz, DSuijkerbuijk, BMFriedlos, FManne, HAKirk, RWhittaker, SMarais, RSpringer, CJ BRAF inhibitors based on an imidazo[4,5]pyridin-2-one scaffold and a meta substituted middle ring. J Med Chem53:1964-78 (2010) 
 
Vascular endothelial growth factor receptor 2
Name:Vascular endothelial growth factor receptor 2
Type:Receptor Tyrosine Kinase
Mol. Mass.:151510.97
Organism:Homo sapiens (Human)
Description:P35968
Residue:1356
BDBM50307880
NameBDBM50307880
Synonyms:CHEMBL598626 | N-(3-tert-butyl-1-phenyl-1H-pyrazol-5-yl)-3-(2-oxo-2,3-dihydro-1H-imidazo[4,5-b]pyridin-7-yloxy)benzamide
TypeSmall organic molecule
Emp. Form.C27H25N5O3
Mol. Mass.467.5191
SMILESCC(C)(C)c1cc(NC(=O)c2cccc(Oc3cccc4[nH]c(=O)[nH]c34)c2)n(n1)-c1ccccc1