Reaction Details
TargetMitogen-activated protein kinase 12
LigandBDBM50307879
Substrate/Competitorn/a
Meas. Tech.ChEMBL_612859 (CHEMBL1067548)
IC50>10000±n/a nM
Citation Nourry, AZambon, ADavies, LNiculescu-Duvaz, IDijkstra, HPMénard, DGaulon, CNiculescu-Duvaz, DSuijkerbuijk, BMFriedlos, FManne, HAKirk, RWhittaker, SMarais, RSpringer, CJ BRAF inhibitors based on an imidazo[4,5]pyridin-2-one scaffold and a meta substituted middle ring. J Med Chem53:1964-78 (2010) 
 
Mitogen-activated protein kinase 12
Name:Mitogen-activated protein kinase 12
Type:Protein
Mol. Mass.:41938.69
Organism:Homo sapiens (Human)
Description:P53778
Residue:367
BDBM50307879
NameBDBM50307879
Synonyms:CHEMBL602123 | N-(2,3,4-trifluoro-5-(2-oxo-2,3-dihydro-1H-imidazo[4,5-b]pyridin-7-yloxy)phenyl)-3-(trifluoromethoxy)benzamide
TypeSmall organic molecule
Emp. Form.C21H11F6N3O4
Mol. Mass.483.3202
SMILESFc1c(NC(=O)c2cccc(OC(F)(F)F)c2)cc(Oc2cccc3[nH]c(=O)[nH]c23)c(F)c1F