Reaction Details
TargetRAF proto-oncogene serine/threonine-protein kinase
LigandBDBM50307878
Substrate/Competitorn/a
Meas. Tech.ChEMBL_612864 (CHEMBL1067553)
IC50 198±n/a nM
Citation Nourry, AZambon, ADavies, LNiculescu-Duvaz, IDijkstra, HPMénard, DGaulon, CNiculescu-Duvaz, DSuijkerbuijk, BMFriedlos, FManne, HAKirk, RWhittaker, SMarais, RSpringer, CJ BRAF inhibitors based on an imidazo[4,5]pyridin-2-one scaffold and a meta substituted middle ring. J Med Chem53:1964-78 (2010) 
 
RAF proto-oncogene serine/threonine-protein kinase
Name:RAF proto-oncogene serine/threonine-protein kinase
Type:Serine/threonine-protein kinase
Mol. Mass.:73082.52
Organism:Homo sapiens (Human)
Description:P04049
Residue:648
BDBM50307878
NameBDBM50307878
Synonyms:1-(3-Tert-butyl-1-phenyl-1H-pyrazol-5-yl)-3-(3-(2-oxo-2,3-dihydro-1Himidazo[4,5-b]pyridin-7-yloxy)phenyl)urea | CHEMBL597592
TypeSmall organic molecule
Emp. Form.C27H26N6O3
Mol. Mass.482.5337
SMILESCC(C)(C)c1cc(NC(=O)Nc2cccc(Oc3cccc4[nH]c(=O)[nH]c34)c2)n(n1)-c1ccccc1