Reaction Details
TargetAcetylcholinesterase
LigandBDBM50307921
Substrate/Competitorn/a
Meas. Tech.ChEMBL_608062 (CHEMBL1072132)
IC50 340±n/a nM
Citation Alptüzün, VPrinz, MHörr, VScheiber, JRadacki, KFallarero, AVuorela, PEngels, BBraunschweig, HErciyas, EHolzgrabe, U Interaction of (benzylidene-hydrazono)-1,4-dihydropyridines with beta-amyloid, acetylcholine, and butyrylcholine esterases. Bioorg Med Chem18:2049-59 (2010) 
 
Acetylcholinesterase
Name:Acetylcholinesterase
Type:Enzyme
Mol. Mass.:71812.79
Organism:Electrophorus electricus (Electric eel)
Description:n/a
Residue:633
BDBM50307921
NameBDBM50307921
Synonyms:(E,E)-1,3-bis[4-[[(2,6-dichlorobenzyloxyl)imino]methyl]pyridinium]propane. dibromide CHEMBL590603
TypeSmall organic molecule
Emp. Form.C29H26Cl4N4O2
Mol. Mass.604.353
SMILESClc1cccc(Cl)c1CO\N=C\c1cc[n+](CCC[n+]2ccc(\C=N\OCc3c(Cl)cccc3Cl)cc2)cc1