Reaction Details
TargetAcetylcholinesterase
LigandBDBM50041517
Substrate/Competitorn/a
Meas. Tech.ChEMBL_608062 (CHEMBL1072132)
IC50 180±n/a nM
Citation Alptüzün, VPrinz, MHörr, VScheiber, JRadacki, KFallarero, AVuorela, PEngels, BBraunschweig, HErciyas, EHolzgrabe, U Interaction of (benzylidene-hydrazono)-1,4-dihydropyridines with beta-amyloid, acetylcholine, and butyrylcholine esterases. Bioorg Med Chem18:2049-59 (2010) 
 
Acetylcholinesterase
Name:Acetylcholinesterase
Type:Enzyme
Mol. Mass.:71812.79
Organism:Electrophorus electricus (Electric eel)
Description:n/a
Residue:633
BDBM50041517
NameBDBM50041517
Synonyms:4-[(2,6-dichloro-benzyloxyimino)-methyl]-1-(3-phenyl-propyl)-pyridinium CHEMBL610796
TypeSmall organic molecule
Emp. Form.C22H21Cl2N2O
Mol. Mass.400.32
SMILESClc1cccc(Cl)c1CO\N=C\c1cc[n+](CCCc2ccccc2)cc1